{"text_format":"1","workbook":"xlsx","n_sheets":17,"sheets":["Settings","Instructions","References","1.General","2.Ex9a_TotCatAdj","3.Ex9b_HistCatEvnts","4.Ex9b_HistCatAdj","5.Ex9b_HistData","6.Ex9c_Mod_WF","7.Ex9c_Mod_FFEQ","8.Ex9c_Mod_Terrorism","9.Ex9c_DCCE_to_Loss","10.Ex9d_Proj_AIY","11.Ex9e_Proj_Ult_NonCAT","12.Ex12a_TotNCOR","13.Ex12b_NCOR_in_Layer","Annual Statement"],"not_rendered":{"charts":0,"images":0,"macros":1,"external_links":3,"defined_names":75,"comments":0,"pivot_tables":0},"unopened":[],"bounds":{"document_bytes":16777216,"sheet_cells":100000,"rows_first":2000,"rows_last":500,"rows_between":2000,"halvings":0,"cell_chars":16384,"cell_head_chars":4096},"cells_cut":0,"cells_raw":0,"read":"whole","date_system":"1900"}

{"sheet":"Settings","index":0,"n_rows":26,"n_cols":2,"rows_kept":26,"cut":false,"hidden":true,"merged":[]}
["For Department Use Only"]
[]
["Click button below to unprotect all sheets of this file."]
[]
["Password:","DrGv9EjE"]
[]
["Click button below to reprotect all sheets of this file."]
[]
[]
["Enter Edition Date here=>","07/14/2025"]
{"$rows_left_out":17}
{"sheet":"Instructions","index":1,"n_rows":17,"n_cols":5,"rows_kept":17,"cut":false,"hidden":false,"merged":[]}
["Instructions for Completing Standard SIS Exhibit 9 (Catastrophe)",null,null,"Instructions for Completing Standard SIS Exhibit 12 (NCOR)"]
["Accompanying the Prior Approval Rate Application",null,null,"Accompanying the Prior Approval Rate Application"]
[]
[null,"Note:  For information on populating the application in its entirety, including the Prior Approval Rate Application, Prior Approval Rate Template, Standard Exhibits Template, and Standard SIS Exhibits Template, refer to the complete Prior Approval Rate Filing Instructions posted in PDF format on the CDI website, below:",null,null,"Note:  For information on populating the application in its entirety, including the Prior Approval Rate Application, Prior Approval Rate Template, Standard Exhibits Template, and Standard SIS  Exhibits Template, refer to the complete Prior Approval Rate Filing Instructions posted in PDF format on the CDI website, below:"]
[null,"http://www.insurance.ca.gov/0250-insurers/0800-rate-filings/"]
[]
["1)","A separate Standard SIS Exhibit 9 is required to be completed for each form (e.g., HO-3, HO-4, HO-6, etc.) or program using a Catastrophe Adjustment Factor in the  Prior Approval Rate Template.  Catastrophe models for certain perils may only be utilized if the insurer complies with the insurer commitments defined in CCR §2644.4.8. For each new filing submitted, download a new template - do not \"recycle\" a template from a previously approved filing.",null,"1)","A separate Standard SIS Exhibit 12 is required to be completed for each form or program and for all filing types with rate impact where the Standard NCOR is considered, as indicated on Page 1 of the Rate Template. Standard NCOR Calculations may only be utilized if the insurer complies with the insurer commitments defined in CCR §2644.25.3. [Note: Rows for Standard NCOR information are hidden at the bottom of Pages 6 to 7 of the Rate Template unless unless Standard NCOR is selected on page 1 of the Rate Template.] For each new filing submitted, download a new template - do not \"recycle\" a template from a previously approved filing."]
["2)","Areas of insurer input are generally identified with blue font text and/or light blue outlined boxes. ",null,"2)","Areas of insurer input are generally identified with blue font text and/or light blue outlined boxes. "]
["3) ","In addition to identifying the form or program included in this template, enter the insurer information common to all forms as well as information specific to the insurer’s treatment of catastrophes in the \"1.General\" page, including, but not limited to, Company Name; General Line; Definitions of Catastrophe and Wildfire; and Catastrophe Models if any.",null,"3)","In addition to identifying the form or program included in this template, enter the insurer information common to all forms in the \"1.General\" page, including, but not limited to, Company Name; General Line; Compliance with Insurer Commitments; Variance Request; and Catastrophe Model Consistency."]
["4)","On pages 3 through 5 of this template ('3.Ex9b_HistCatEvnts', '4.Ex9b_HistCatAdj' and '5.Ex9b_HistData'), enter historical catastrophe events, historical AIY and alternate weightings by year, historical catastrophe and non-catastrophe data by year, including paid, case-incurred, IBNR, subrogation and salvage detail.  This historical data must be entered separately for perils modeled and perils not modeled.",null,"4)","If the Company is afilliated with an insurer group, as determined by the NAIC, enter the NAIC Group Code.  If the Company is not affiliated with an insurer group, as determined by the NAIC, enter the NAIC Company Code. Property Direct Written Premiums for the Most Recently Available Calendar Year will automatically be populated based on the NAIC code entered."]
{"$rows_left_out":8}
{"sheet":"References","index":2,"n_rows":44,"n_cols":24,"rows_kept":44,"cut":false,"hidden":true,"merged":[]}
["For Department Use Only"]
[null,"Y/N Indicator",null,"Line Type",null,"General Line (Page 1)",null,null,"Detailed Line Description/AS Line Number (Page 1)",null,null,"Data Aggregation Method (Page 1)",null,"Exhibits to Print (Page 1)",null,"Detailed Line Description(s) Converter",null,null,"Peril (Page 1)",null,"CAT Methodology",null,null,"AAL Options"]
[null,"Y/N/na Indicator",null,null,null,null,null,null,null,null,null,null,null,null,null,"(Index to text)"]
[null,"(Not Used)"]
["Combo Box controls listed to the right on this row, if applicable=>",null,null,3,null,1,{"$f":"INDEX($F$30:$F$39,F5)","v":0},null,null,null,null,{"$f":"MATCH('1.General'!C20,List_AggMethod,0)","v":{"$error":"#N/A"}},null,4,null,null,null,null,2]
[null,"Yes",null,"Commercial",null,null,null,null,null,null,null,"Accident Year Data",null,"Exhibit 5",null,1,1,null,null,null,null,null,null,"Average Annual Loss with Demand Surge"]
[null,"No",null,"Personal",null,"Aircraft",null,null,"Aircraft",22,null,"Report Year Data (Claims-Made policies only)",null,"Exhibit 7",null,2,1,null,"Severe Convective Storm",null,"Auto Liability and Physical Damage","CAT to non-CAT",null,"Average Annual Loss without Demand Surge"]
[null,"n/a",null,null,null,"Allied Lines",null,null,"Allied Lines",2.1,null,"Policy Year Data (Multi-Year policies only)",null,"Exhibit 8",null,3,1,null,"Winterstorm",null,"Earthquake","CAT to AIY"]
[null,null,null,null,null,"Allied Lines & Other Liability",null,null,"Boiler & Machinery",27,null,null,null,"All Exhibits",null,4,1,null,"Wind",null,"Flood","CAT to AIY"]
[null,null,null,null,null,"Auto Liability and Physical Damage",null,null,"Burglary & Theft",26,null,null,null,null,null,5,1,null,"Water",null,"Homeowners","CAT to AIY"]
{"$rows_left_out":35}
{"sheet":"1.General","index":3,"n_rows":61,"n_cols":9,"rows_kept":61,"cut":false,"hidden":false,"merged":[[40,0,40,2],[11,2,11,5],[33,0,33,2],[33,5,33,6],[36,5,36,6],[36,0,36,2],[19,2,19,5]]}
["State of California",null,null,null,null,"Company:",{"$f":"Co_Name","v":""},null,"Error Messages, if Any, Associated with General to the Left"]
["Department of Insurance (CDI)",null,null,null,null,"Line:",{"$f":"General_Line","v":0},null,"(DEPARTMENT USE ONLY)"]
[]
[]
["STANDARD EXHIBIT 9 TEMPLATE"]
["GENERAL INFORMATION"]
[]
["Completed by:",null,"Date:"]
[]
["Proposed Effective Date:"]
{"$rows_left_out":52}
{"sheet":"2.Ex9a_TotCatAdj","index":4,"n_rows":25,"n_cols":7,"rows_kept":25,"cut":false,"hidden":false,"merged":[]}
[{"$f":"Co_Name","v":""},null,null,null,null,null,"Error Messages, if Any, Associated with General to the Left"]
[{"$f":"INDEX(List_LineType,Index_Line_Type)&\" \"&INDEX(List_GeneralLine,Index_General_Line)","v":" "},null,null,null,null,null,"(DEPARTMENT USE ONLY)"]
[]
["Catastrophe Exhibit Summary"]
[{"$f":"\"\"&'1.General'!$C$18","v":""}]
[]
[]
[null,{"$f":"\"Catastrophe Loss & DCCE per Exposure based on Historical Data\"&(IF(OR(ind_model_wf=\"Yes\",ind_model_ffeq=\"Yes\",ind_model_terr=\"Yes\"),\" excl Modeled Perils\",\"\"))","v":"Catastrophe Loss & DCCE per Exposure based on Historical Data"}]
[null,"   Earned Exposure Units",null,{"$f":"+'10.Ex9d_Proj_AIY'!H37","v":""}]
[null,"   Projected AIY",null,{"$f":"'10.Ex9d_Proj_AIY'!E51","v":{"$error":"#VALUE!"}}]
{"$rows_left_out":16}
{"sheet":"3.Ex9b_HistCatEvnts","index":5,"n_rows":8,"n_cols":11,"rows_kept":8,"cut":false,"hidden":false,"merged":[]}
["State of California",null,null,null,null,"                                                  Company:",null,null,null,{"$f":"Co_Name","v":""},"Error Messages, if Any, Associated with General to the Left"]
["Department of Insurance (CDI)",null,null,null,null,"                                                  Line:",null,null,null,{"$f":"General_Line","v":0},"(DEPARTMENT USE ONLY)"]
[]
[]
[]
["List of major events contributing to catastrophe losses:"]
[]
[null,"Name of Event:",null,"Peril(s) Impacted:",null,"Date(s):",null,"Was there a Subrogration Recovery?",null,"Was there a sale of Subrogation Rights?"]

{"sheet":"4.Ex9b_HistCatAdj","index":6,"n_rows":52,"n_cols":15,"rows_kept":52,"cut":false,"hidden":false,"merged":[]}
[{"$f":"Co_Name","v":""},null,null,null,null,null,null,null,{"$f":"Co_Name","v":""}]
[{"$f":"INDEX(List_LineType,Index_Line_Type)&\" \"&INDEX(List_GeneralLine,Index_General_Line)","v":" "},null,null,null,null,null,null,null,{"$f":"INDEX(List_LineType,Index_Line_Type)&\" \"&INDEX(List_GeneralLine,Index_General_Line)","v":" "}]
[]
["Catastrophe Loss and DCCE to AIY",null,null,null,null,null,null,null,"Catastrophe Loss and DCCE to AIY"]
[{"$f":"'1.General'!$C$18&\" - \"&\"All Perils\"&(IF(OR(ind_model_wf=\"Yes\",ind_model_ffeq=\"Yes\",ind_model_terr=\"Yes\"),\" excl \"&_xlfn.TEXTJOIN(\",\",TRUE,IF('1.General'!$C$28:$C$30=\"Yes\",'1.General'!$A$28:$A$30,\"\")),\"\"))","v":" - All Perils"},null,null,null,null,null,null,null,{"$f":"'1.General'!$C$18&\" - \"&\"All Perils\"","v":" - All Perils"}]
[]
[]
[]
[{"$f":"\"Fiscal \"&AggMethod&\" Ending\"","v":{"$error":"#N/A"}},null,"Non-Catastrophe Ultimate Loss & DCCE","Catastrophe Ultimate Loss & DCCE","Catastrophe Loss & DCCE to AIY","Alternate Weighting","AIY",null,{"$f":"\"Fiscal \"&AggMethod&\" Ending\"","v":{"$error":"#N/A"}},null,"Non-Catastrophe Ultimate Loss & DCCE","Catastrophe Ultimate Loss & DCCE","Catastrophe Loss & DCCE to AIY","Alternate Weighting","AIY"]
[{"$f":"A11-10","v":-340},null,{"$f":"+'5.Ex9b_HistData'!J10","v":0},{"$f":"'5.Ex9b_HistData'!$U10*(AND(('1.General'!$C$28=\"No\"),('1.General'!$C$29=\"No\"),('1.General'!$C$30=\"No\")))+'5.Ex9b_HistData'!$AF10","v":0},{"$f":"IFERROR(D10/G10,\"\")","v":""},null,null,null,{"$f":"I11-10","v":-340},null,{"$f":"+'5.Ex9b_HistData'!J10","v":0},{"$f":"'5.Ex9b_HistData'!$U10+'5.Ex9b_HistData'!$AF10","v":0},{"$f":"IFERROR(L10/O10,\"\")","v":""},{"$f":"+F10","v":0},{"$f":"+G10","v":0}]
{"$rows_left_out":43}
{"sheet":"5.Ex9b_HistData","index":7,"n_rows":46,"n_cols":32,"rows_kept":46,"cut":false,"hidden":false,"merged":[]}
[{"$f":"Co_Name","v":""},null,null,null,null,null,null,null,null,null,null,{"$f":"Co_Name","v":""},null,null,null,null,null,null,null,null,null,null,{"$f":"Co_Name","v":""}]
[{"$f":"INDEX(List_LineType,Index_Line_Type)&\" \"&INDEX(List_GeneralLine,Index_General_Line)","v":" "},null,null,null,null,null,null,null,null,null,null,{"$f":"INDEX(List_LineType,Index_Line_Type)&\" \"&INDEX(List_GeneralLine,Index_General_Line)","v":" "},null,null,null,null,null,null,null,null,null,null,{"$f":"INDEX(List_LineType,Index_Line_Type)&\" \"&INDEX(List_GeneralLine,Index_General_Line)","v":" "}]
[]
["Historical Non-Catastrophe Loss and DCCE Data",null,null,null,null,null,null,null,null,null,null,"Historical Catastrophe Loss and DCCE Data",null,null,null,null,null,null,null,null,null,null,"Historical Catastrophe Loss and DCCE Data"]
[{"$f":"'1.General'!$C$18","v":0},null,null,null,null,null,null,null,null,null,null,{"$f":"IF(OR(ind_model_wf=\"Yes\",ind_model_ffeq=\"Yes\",ind_model_terr=\"Yes\"),'1.General'!$C$18 &\" - \"&\"Perils\"&\": \"&_xlfn.TEXTJOIN(\",\",TRUE,IF('1.General'!$C$28:$C$30=\"Yes\",'1.General'!$A$28:$A$30,\"\")),\"No need to complete this section\")","v":"No need to complete this section"},null,null,null,null,null,null,null,null,null,null,{"$f":"'1.General'!$C$18&\" - \"&\"All Perils\"&(IF(OR(ind_model_wf=\"Yes\",ind_model_ffeq=\"Yes\",ind_model_terr=\"Yes\"),\" excl \"&_xlfn.TEXTJOIN(\",\",TRUE,IF('1.General'!$C$28:$C$30=\"Yes\",'1.General'!$A$28:$A$30,\"\")),\"\"))","v":" - All Perils"}]
[null,null,null,null,null,null,null,null,null,null," "]
[]
[null,"Loss Net of Subrogration/Salvage",null,null,"DCCE",null,null," ",null," ",null,null,"Loss Net of Subrogration/Salvage",null,null,"DCCE",null,null,null,null," ",null,null,"Loss Net of Subrogration/Salvage",null,null,"DCCE",null,null,null,null," "]
[{"$f":"\"Fiscal \"&AggMethod&\" Ending\"","v":{"$error":"#N/A"}},"Paid Loss","Case-Incurred Loss\n(Paid Loss + \nCase Loss Reserves)","IBNR Loss","Paid DCCE","Case-Incurred DCCE\n(Paid DCCE + \nCase DCCE Reserves)","IBNR DCCE","Salvage & Subrogation Received","Salvage & Subrogation Anticipated","Total Non-Catastrophe Net Loss & DCCE",null,{"$f":"\"Fiscal \"&AggMethod&\" Ending\"","v":{"$error":"#N/A"}},"Paid Loss","Case-Incurred Loss\n(Paid Loss + \nCase Loss Reserves)","IBNR Loss","Paid DCCE","Case-Incurred DCCE\n(Paid DCCE + \nCase DCCE Reserves)","IBNR DCCE","Salvage & Subrogation Received","Salvage & Subrogation Anticipated",{"$f":"\"Total \"&_xlfn.TEXTJOIN(\",\",TRUE,IF('1.General'!$C$28:$C$30=\"Yes\",'1.General'!$A$28:$A$30,\"\"))&\" Catastrophe Net Loss & DCCE\"","v":"Total  Catastrophe Net Loss & DCCE"},null,{"$f":"\"Fiscal \"&AggMethod&\" Ending\"","v":{"$error":"#N/A"}},"Paid Loss","Case-Incurred Loss\n(Paid Loss + \nCase Loss Reserves)","IBNR Loss","Paid DCCE","Case-Incurred DCCE\n(Paid DCCE + \nCase DCCE Reserves)","IBNR DCCE","Salvage & Subrogation Received","Salvage & Subrogation Anticipated",{"$f":"\"Total Catastrophe Net Loss & DCCE\"&(IF(OR(ind_model_wf=\"Yes\",ind_model_ffeq=\"Yes\",ind_model_terr=\"Yes\"),\" excl \"&_xlfn.TEXTJOIN(\",\",TRUE,IF('1.General'!$C$28:$C$30=\"Yes\",'1.General'!$A$28:$A$30,\"\")),\"\"))","v":"Total Catastrophe Net Loss & DCCE"}]
[{"$f":"A11-10","v":-340},null,null,null,null,null,null,null,null,{"$f":"SUM(C10:D10,F10:G10)","v":0},null,{"$f":"L11-10","v":-340},null,null,null,null,null,null,null,null,{"$f":"SUM(N10:O10,Q10:R10)","v":0},null,{"$f":"W11-10","v":-340},null,null,null,null,null,null,null,null,{"$f":"SUM(Y10:Z10,AB10:AC10)","v":0}]
{"$rows_left_out":37}
{"sheet":"6.Ex9c_Mod_WF","index":8,"n_rows":46,"n_cols":9,"rows_kept":46,"cut":false,"hidden":true,"merged":[[21,2,21,6]]}
[{"$f":"Co_Name","v":""},null,null,null,null,null,null,null,"Error Messages, if Any, Associated with General to the Left"]
[{"$f":"INDEX(List_LineType,Index_Line_Type)&\" \"&INDEX(List_GeneralLine,Index_General_Line)","v":" "},null,null,null,null,null,null,null,"(DEPARTMENT USE ONLY)"]
[]
["Projected Average Annual Loss and DCCE for Modeled Catastrophes"]
[{"$f":"'1.General'!$C$18","v":0}]
[]
["Wildfire Peril"]
["Model Information",null,"Model #1",null,"Model #2",null,"Model #3"]
[]
["Model Name:"]
{"$rows_left_out":37}
{"sheet":"7.Ex9c_Mod_FFEQ","index":9,"n_rows":46,"n_cols":9,"rows_kept":46,"cut":false,"hidden":true,"merged":[[21,2,21,6]]}
[{"$f":"Co_Name","v":""},null,null,null,null,null,null,null,"Error Messages, if Any, Associated with General to the Left"]
[{"$f":"INDEX(List_LineType,Index_Line_Type)&\" \"&INDEX(List_GeneralLine,Index_General_Line)","v":" "},null,null,null,null,null,null,null,"(DEPARTMENT USE ONLY)"]
[]
["Projected Average Annual Loss and DCCE for Modeled Catastrophes"]
[{"$f":"'1.General'!$C$18","v":0}]
[]
["Fire Following Earthquake (FFEQ) Peril"]
["Model Information",null,"Model #1",null,"Model #2",null,"Model #3"]
[]
["Model Name:"]
{"$rows_left_out":37}
{"sheet":"8.Ex9c_Mod_Terrorism","index":10,"n_rows":46,"n_cols":9,"rows_kept":46,"cut":false,"hidden":true,"merged":[[21,2,21,6]]}
[{"$f":"Co_Name","v":""},null,null,null,null,null,null,null,"Error Messages, if Any, Associated with General to the Left"]
[{"$f":"INDEX(List_LineType,Index_Line_Type)&\" \"&INDEX(List_GeneralLine,Index_General_Line)","v":" "},null,null,null,null,null,null,null,"(DEPARTMENT USE ONLY)"]
[]
["Projected Average Annual Loss and DCCE for Modeled Catastrophes"]
[{"$f":"'1.General'!$C$18","v":0}]
[]
["Terrorism Peril"]
["Model Information",null,"Model #1",null,"Model #2",null,"Model #3"]
[]
["Model Name:"]
{"$rows_left_out":37}
{"sheet":"9.Ex9c_DCCE_to_Loss","index":11,"n_rows":52,"n_cols":6,"rows_kept":52,"cut":false,"hidden":true,"merged":[]}
[{"$f":"Co_Name","v":""}]
[{"$f":"INDEX(List_LineType,Index_Line_Type)&\" \"&INDEX(List_GeneralLine,Index_General_Line)","v":" "}]
[]
["DCCE Ratio Applied to Modeled Catastrophes"]
[{"$f":"'1.General'!$C$18","v":0}]
[]
["Based on CAT or Non-CAT data?"]
[]
[]
[{"$f":"\"Fiscal \"&AggMethod&\" Ending\"","v":{"$error":"#N/A"}},null,{"$f":"E$7&\" Loss\"","v":" Loss"},{"$f":"E$7&\" DCCE\"","v":" DCCE"},{"$f":"\"Ratio of \"&E$7&\" DCCE to \"&E$7&\" Loss\"","v":"Ratio of  DCCE to  Loss"},"Alternate Weighting"]
{"$rows_left_out":43}
{"sheet":"10.Ex9d_Proj_AIY","index":12,"n_rows":51,"n_cols":10,"rows_kept":51,"cut":false,"hidden":false,"merged":[]}
[null,{"$f":"Co_Name","v":""}]
[null,{"$f":"INDEX(List_LineType,Index_Line_Type)&\" \"&INDEX(List_GeneralLine,Index_General_Line)","v":" "}]
[]
[null,"AIY Trend"]
[null,{"$f":"\"California Company-Specific AIY Trend Data - \"&'1.General'!$C$18","v":"California Company-Specific AIY Trend Data - "}]
[]
[]
[]
[null,null,null,"Quarterly Data",null,null,null,"Rolling 4-Quarter Data"]
[null,"Calendar YYYYQ",null,"Earned Exposures","Earned AIY\n($000)","AIY/ Exposures",null,{"$f":"D10","v":"Earned Exposures"},{"$f":"E10","v":"Earned AIY\n($000)"},{"$f":"F10","v":"AIY/ Exposures"}]
{"$rows_left_out":42}
{"sheet":"11.Ex9e_Proj_Ult_NonCAT","index":13,"n_rows":18,"n_cols":8,"rows_kept":18,"cut":false,"hidden":false,"merged":[]}
[{"$f":"Co_Name","v":""}]
[{"$f":"INDEX(List_LineType,Index_Line_Type)&\" \"&INDEX(List_GeneralLine,Index_General_Line)","v":" "}]
[{"$f":"\"\"&'1.General'!$C$18","v":""}]
["Projected Ultimate Trended Non-Catastrophe Loss & DCCE per Exposure"]
[]
[]
["Description","Source","5th Prior Year Ending","4th Prior Year Ending","3rd Prior Year Ending","2nd Prior Year Ending","1st Prior Year Ending","Most Recent Year Ending"]
["Year",null,{"$f":"+D8-10","v":-50},-40,-30,-20,{"$f":"+H8-10","v":-10},{"$f":"+FYQtr_CATnonmdl","v":0}]
["Earned Exposure Units","Rate Tl Pg6 Ln 6"]
["Historic Losses","Rate Tl Pg6 Ln 7"]
{"$rows_left_out":9}
{"sheet":"12.Ex12a_TotNCOR","index":14,"n_rows":14,"n_cols":10,"rows_kept":14,"cut":false,"hidden":true,"merged":[]}
[]
[]
[]
["Standard Net Cost of Reinsurance for Modeled Catastrophes"]
[{"$f":"'1.General'!$C$18","v":0}]
[]
[null,"Peril",null,"Calculated NCOR",null,"Selected DCCE-to-Loss",null,"Standard NCOR",null,"Total Standard NCOR"]
[null,"Description",null,"per Exposure",null,"Ratio (Exhibit 9c)",null,"per Exposure",null,"per Exposure"]
[null,"Wildfire",null,{"$f":"'13.Ex12b_NCOR_in_Layer'!$N$31","v":0},null,{"$f":"'9.Ex9c_DCCE_to_Loss'!$E$52","v":0},null,{"$f":"D9*(1+F9)","v":0},null,{"$f":"H9/H13*H14","v":{"$error":"#DIV/0!"}}]
[null,"Fire Following Earthquake",null,{"$f":"'13.Ex12b_NCOR_in_Layer'!$N$63","v":0},null,{"$f":"'9.Ex9c_DCCE_to_Loss'!$E$52","v":0},null,{"$f":"D10*(1+F10)","v":0},null,{"$f":"H10/H13*H14","v":{"$error":"#DIV/0!"}}]
{"$rows_left_out":5}
{"sheet":"13.Ex12b_NCOR_in_Layer","index":15,"n_rows":63,"n_cols":77,"rows_kept":63,"cut":false,"hidden":true,"merged":[[26,73,26,76],[8,23,8,29],[8,31,8,37],[40,23,40,29],[40,31,40,37],[25,19,25,21],[8,59,8,65],[8,7,8,13],[8,15,8,21],[40,7,40,13],[40,15,40,21],[8,51,8,57]]}
[]
[]
[]
[null,null,null,null,null,null,null,"Calculated Net Cost of Reinsurance for Modeled Catastrophes by Peril",null,null,null,null,null,null,null,null,null,null,null,null,null,null,null,"Calculated Net Cost of Reinsurance for Modeled Catastrophes by Peril",null,null,null,null,null,null,null,null,null,null,null,null,null,null,null,null,null,null,null,null,null,"Calculated Net Cost of Reinsurance for Modeled Catastrophes by Peril"]
[null,null,null,null,null,null,null,"Wildfire",null,null,null,null,null,null,null,null,null,null,null,null,null,null,null,"Wildfire",null,null,null,null,null,null,null,null,null,null,null,null,null,null,null,null,null,null,null,null,null," "]
[null,null,null,null,null,null,null,{"$f":"'1.General'!$C$18","v":0},null,null,null,null,null,null,null,null,null,null,null,null,null,null,null,{"$f":"'1.General'!$C$18","v":0},null,null,null,null,null,null,null,null,null,null,null,null,null,null,null,null,null,null,null,null,null,{"$f":"'1.General'!$C$18","v":0}]
[null,null,null,null,null,null,null,null,null,null,null,null,null,null,null,null,null,null,null,null,null,null,null,null,null,null,null,null,null,null,null,null,null,null,null,null,null,null,null,null,null,null,null,null,null,null,null,null,null,null,null,null,null,null,null,null,null,null,null,null,null,null,null,null,null,null,null,"(DEPARTMENT USE ONLY)"]
[null,null,null,null,null,null,null,"Selected Model",null,null,null,null,null,null,null,"Model #1",null,null,null,null,null,null,null,"Model #2",null,null,null,null,null,null,null,"Model #3",null,null,null,null,null,null,null,null,null,null,null,null,null,null,null,null,null,null,null,"Selected Model",null,null,null,null,null,null,null,"Model #1"]
[null,"CDI Parameters",null,null,null,null,null,null,null,null,null,null,null,null,null,null,null,null,null,null,null,null,null,null,null,null,null,null,null,null,null,null,null,null,null,null,null,null,null,null,null,null,null,null,null,"CDI Parameters",null,null,null,null,null,null,null,null,null,null,null,null,null,null,null,null,null,null,null,null,null,"CDI Parameters"]
[null,"Attachment",null,"Exhaustion",null,"Return Multiple",null,"Attachment Point",null,"Exhaustion Point",null,"Expected Loss",null,"Standard NCOR",null,"Attachment Point",null,"Exhaustion Point",null,"Expected Loss",null,"Standard NCOR",null,"Attachment Point",null,"Exhaustion Point",null,"Expected Loss",null,"Standard NCOR",null,"Attachment Point",null,"Exhaustion Point",null,"Expected Loss",null,"Standard NCOR",null,null,null,null,null,null,null,"Attachment",null,"Exhaustion",null,"Return Multiple",null,"Attachment Point",null,"Exhaustion Point",null,"Expected Loss",null,"Standard NCOR",null,"Attachment Point",null,"Exhaustion Point",null,"Expected Loss",null,"Standard NCOR",null,"Attachment",null,"Exhaustion",null,"Return Multiple"]
{"$rows_left_out":54}
{"sheet":"Annual Statement","index":16,"n_rows":158,"n_cols":5,"rows_kept":158,"cut":false,"hidden":true,"merged":[]}
["California Concentration"]
["Source:","Annual Statements - Page 14 and Exhibit 1B"]
["Edition:",2024]
["Last year of data:",2024]
["Prepared by:","Rate Regulation Branch"]
["Last revised:","2025-06-26"]
[]
[]
[]
["Group Code","Group Name","CA Property DWP","CW Property DWP","CA Concentration"]
{"$rows_left_out":148}